Target
Oxysterols receptor LXR-beta
Ligand
BDBM49392
Substrate
Meas. Tech.
Counterscreen for agonists of the daf-12 abnormal Dauer Formation: Luminescence-based cell-based dose response assay to identify agonists of the Liver-X-Receptor (LXR).
EC50
67527±n/a nM
Citation
 PubChem, PC Counterscreen for agonists of the daf-12 abnormal Dauer Formation: Luminescence-based cell-based dose response assay to identify agonists of the Liver-X-Receptor (LXR). PubChem Bioassay (2013)[AID] 
Target
Name:
Oxysterols receptor LXR-beta
Synonyms:
LXRB Liver X, LXR beta NR1H2 Nuclear receptor NER Ubiquitously-expressed nuclear receptor
Type:
Enzyme Catalytic Domain
Mol. Mass.:
50978.79
Organism:
Homo sapiens (Human)
Description:
P55055
Residue:
460
  
Inhibitor
Name:
BDBM49392
Synonyms:
6-methyl-2-(5-methyl-1H-benzimidazol-2-yl)thieno[2,3-b]pyridin-3-ylamine 6-methyl-2-(6-methyl-1H-benzimidazol-2-yl)thieno[2,3-b]pyridin-3-amine SMR000115129 cid_845805
Type:
Small organic molecule
Emp. Form.:
C16H14N4S
Mol. Mass.:
294.374
SMILES:
Cc1ccc2nc([nH]c2c1)-c1sc2nc(C)ccc2c1N
: