Target
Oxysterols receptor LXR-beta
Ligand
BDBM49453
Substrate
Meas. Tech.
Counterscreen for agonists of the daf-12 abnormal Dauer Formation: Luminescence-based cell-based dose response assay to identify agonists of the Liver-X-Receptor (LXR).
EC50
67541±n/a nM
Citation
 PubChem, PC Counterscreen for agonists of the daf-12 abnormal Dauer Formation: Luminescence-based cell-based dose response assay to identify agonists of the Liver-X-Receptor (LXR). PubChem Bioassay (2013)[AID] 
Target
Name:
Oxysterols receptor LXR-beta
Synonyms:
LXRB Liver X, LXR beta NR1H2 Nuclear receptor NER Ubiquitously-expressed nuclear receptor
Type:
Enzyme Catalytic Domain
Mol. Mass.:
50978.79
Organism:
Homo sapiens (Human)
Description:
P55055
Residue:
460
  
Inhibitor
Name:
BDBM49453
Synonyms:
(2Z)-2-(3-methyl-1,3-benzothiazol-2-ylidene)-1-(2-thienyl)ethanone (2Z)-2-(3-methyl-1,3-benzothiazol-2-ylidene)-1-thiophen-2-ylethanone MLS000536852 cid_1633230
Type:
Small organic molecule
Emp. Form.:
C14H11NOS2
Mol. Mass.:
273.373
SMILES:
CN1\C(Sc2ccccc12)=C\C(=O)c1cccs1
: