Target
Oxysterols receptor LXR-beta
Ligand
BDBM49507
Substrate
Meas. Tech.
Counterscreen for agonists of the daf-12 abnormal Dauer Formation: Luminescence-based cell-based dose response assay to identify agonists of the Liver-X-Receptor (LXR).
EC50
67537±n/a nM
Citation
 PubChem, PC Counterscreen for agonists of the daf-12 abnormal Dauer Formation: Luminescence-based cell-based dose response assay to identify agonists of the Liver-X-Receptor (LXR). PubChem Bioassay (2013)[AID] 
Target
Name:
Oxysterols receptor LXR-beta
Synonyms:
LXRB Liver X, LXR beta NR1H2 Nuclear receptor NER Ubiquitously-expressed nuclear receptor
Type:
Enzyme Catalytic Domain
Mol. Mass.:
50978.79
Organism:
Homo sapiens (Human)
Description:
P55055
Residue:
460
  
Inhibitor
Name:
BDBM49507
Synonyms:
4H-3,1-benzothiazin-2-yl-(4-methylbenzyl)amine N-(4-methylbenzyl)-4H-3,1-benzothiazin-2-amine SMR000169300 | cid_3721736
Type:
Small organic molecule
Emp. Form.:
C16H16N2S
Mol. Mass.:
268.377
SMILES:
Cc1ccc(CN=C2Nc3ccccc3CS2)cc1
: