Target
Oxysterols receptor LXR-beta
Ligand
BDBM114744
Substrate
Meas. Tech.
Counterscreen for agonists of the daf-12 abnormal Dauer Formation: Luminescence-based cell-based dose response assay to identify agonists of the Liver-X-Receptor (LXR).
EC50
67541±n/a nM
Citation
 PubChem, PC Counterscreen for agonists of the daf-12 abnormal Dauer Formation: Luminescence-based cell-based dose response assay to identify agonists of the Liver-X-Receptor (LXR). PubChem Bioassay (2013)[AID] 
Target
Name:
Oxysterols receptor LXR-beta
Synonyms:
LXRB Liver X, LXR beta NR1H2 Nuclear receptor NER Ubiquitously-expressed nuclear receptor
Type:
Enzyme Catalytic Domain
Mol. Mass.:
50978.79
Organism:
Homo sapiens (Human)
Description:
P55055
Residue:
460
  
Inhibitor
Name:
BDBM114744
Synonyms:
5-methyl-3,7-diphenyl-pyrazolo[1,5-a]pyrimidine MLS000681210 cid_832119
Type:
Small organic molecule
Emp. Form.:
C19H15N3
Mol. Mass.:
285.3425
SMILES:
Cc1cc(-c2ccccc2)n2ncc(-c3ccccc3)c2n1
: