Target
Oxysterols receptor LXR-beta
Ligand
BDBM114828
Substrate
Meas. Tech.
Counterscreen for agonists of the daf-12 abnormal Dauer Formation: Luminescence-based cell-based dose response assay to identify agonists of the Liver-X-Receptor (LXR).
EC50
67507±n/a nM
Citation
 PubChem, PC Counterscreen for agonists of the daf-12 abnormal Dauer Formation: Luminescence-based cell-based dose response assay to identify agonists of the Liver-X-Receptor (LXR). PubChem Bioassay (2013)[AID] 
Target
Name:
Oxysterols receptor LXR-beta
Synonyms:
LXRB Liver X, LXR beta NR1H2 Nuclear receptor NER Ubiquitously-expressed nuclear receptor
Type:
Enzyme Catalytic Domain
Mol. Mass.:
50978.79
Organism:
Homo sapiens (Human)
Description:
P55055
Residue:
460
  
Inhibitor
Name:
BDBM114828
Synonyms:
(1Z)-1-[amino(phenyl)methylene]-3-(1,3-benzodioxol-5-yl)thiourea (1Z)-1-[azanyl(phenyl)methylidene]-3-(1,3-benzodioxol-5-yl)thiourea SMR001994974 | cid_51360485
Type:
Small organic molecule
Emp. Form.:
C15H13N3O2S
Mol. Mass.:
299.348
SMILES:
NC(=NC(=S)Nc1ccc2OCOc2c1)c1ccccc1
: