Target
Oxysterols receptor LXR-beta
Ligand
BDBM49665
Substrate
Meas. Tech.
Counterscreen for agonists of the daf-12 abnormal Dauer Formation: Luminescence-based cell-based dose response screening assay to identify agonists of the Liver-X-Receptor (LXR)
EC50
67528±n/a nM
Citation
 PubChem, PC Counterscreen for agonists of the daf-12 abnormal Dauer Formation: Luminescence-based cell-based dose response screening assay to identify agonists of the Liver-X-Receptor (LXR) PubChem Bioassay (2013)[AID] 
Target
Name:
Oxysterols receptor LXR-beta
Synonyms:
LXRB Liver X, LXR beta NR1H2 Nuclear receptor NER Ubiquitously-expressed nuclear receptor
Type:
Enzyme Catalytic Domain
Mol. Mass.:
50978.79
Organism:
Homo sapiens (Human)
Description:
P55055
Residue:
460
  
Inhibitor
Name:
BDBM49665
Synonyms:
4-(1-benzofuran-2-yl)-N-(2-methoxyethyl)-1,3-thiazol-2-amine MLS000388876 [4-(benzofuran-2-yl)thiazol-2-yl]-(2-methoxyethyl)amine | cid_2469776
Type:
Small organic molecule
Emp. Form.:
C14H14N2O2S
Mol. Mass.:
274.338
SMILES:
COCCNc1nc(cs1)-c1cc2ccccc2o1
: