Target
Oxysterols receptor LXR-beta
Ligand
BDBM96684
Substrate
Meas. Tech.
Counterscreen for agonists of the daf-12 abnormal Dauer Formation: Luminescence-based cell-based screening assay to identify agonists of the Liver-X-Receptor (LXR).
IC50
67502±n/a nM
Citation
 PubChem, PC Counterscreen for agonists of the daf-12 abnormal Dauer Formation: Luminescence-based cell-based screening assay to identify agonists of the Liver-X-Receptor (LXR). PubChem Bioassay (2013)[AID] 
Target
Name:
Oxysterols receptor LXR-beta
Synonyms:
LXRB Liver X, LXR beta NR1H2 Nuclear receptor NER Ubiquitously-expressed nuclear receptor
Type:
Enzyme Catalytic Domain
Mol. Mass.:
50978.79
Organism:
Homo sapiens (Human)
Description:
P55055
Residue:
460
  
Inhibitor
Name:
BDBM96684
Synonyms:
6-acetyl-2-(2-phenylethyl)benzo[de]isoquinoline-1,3-dione 6-ethanoyl-2-(2-phenylethyl)benzo[de]isoquinoline-1,3-dione SMR000289583 | cid_2929978
Type:
Small organic molecule
Emp. Form.:
C22H17NO3
Mol. Mass.:
343.3753
SMILES:
CC(=O)c1ccc2C(=O)N(CCc3ccccc3)C(=O)c3cccc1c23
: