Target
Oxysterols receptor LXR-beta
Ligand
BDBM114917
Substrate
Meas. Tech.
Counterscreen for agonists of the daf-12 abnormal Dauer Formation: Luminescence-based cell-based screening assay to identify agonists of the Liver-X-Receptor (LXR).
IC50
67507±n/a nM
Citation
 PubChem, PC Counterscreen for agonists of the daf-12 abnormal Dauer Formation: Luminescence-based cell-based screening assay to identify agonists of the Liver-X-Receptor (LXR). PubChem Bioassay (2013)[AID] 
Target
Name:
Oxysterols receptor LXR-beta
Synonyms:
LXRB Liver X, LXR beta NR1H2 Nuclear receptor NER Ubiquitously-expressed nuclear receptor
Type:
Enzyme Catalytic Domain
Mol. Mass.:
50978.79
Organism:
Homo sapiens (Human)
Description:
P55055
Residue:
460
  
Inhibitor
Name:
BDBM114917
Synonyms:
MLS001000910 N-(2-methyl-5-nitrophenyl)cyclopentanecarboxamide cid_898570
Type:
Small organic molecule
Emp. Form.:
C13H16N2O3
Mol. Mass.:
248.2777
SMILES:
Cc1ccc(cc1NC(=O)C1CCCC1)[N+]([O-])=O
: