Target
Oxysterols receptor LXR-beta
Ligand
BDBM114927
Substrate
Meas. Tech.
Counterscreen for agonists of the daf-12 abnormal Dauer Formation: Luminescence-based cell-based screening assay to identify agonists of the Liver-X-Receptor (LXR).
IC50
67478±n/a nM
Citation
 PubChem, PC Counterscreen for agonists of the daf-12 abnormal Dauer Formation: Luminescence-based cell-based screening assay to identify agonists of the Liver-X-Receptor (LXR). PubChem Bioassay (2013)[AID] 
Target
Name:
Oxysterols receptor LXR-beta
Synonyms:
LXRB Liver X, LXR beta NR1H2 Nuclear receptor NER Ubiquitously-expressed nuclear receptor
Type:
Enzyme Catalytic Domain
Mol. Mass.:
50978.79
Organism:
Homo sapiens (Human)
Description:
P55055
Residue:
460
  
Inhibitor
Name:
BDBM114927
Synonyms:
2-[4-(4-chlorophenyl)-1-keto-phthalazin-2-yl]-N-(2-methoxyethyl)acetamide 2-[4-(4-chlorophenyl)-1-oxo-2-phthalazinyl]-N-(2-methoxyethyl)acetamide 2-[4-(4-chlorophenyl)-1-oxophthalazin-2-yl]-N-(2-methoxyethyl)acetamide SMR000558461 | cid_1829088
Type:
Small organic molecule
Emp. Form.:
C19H18ClN3O3
Mol. Mass.:
371.818
SMILES:
COCCNC(=O)Cn1nc(-c2ccc(Cl)cc2)c2ccccc2c1=O
: