Target
PC4 and SFRS1-interacting protein
Ligand
BDBM53382
Substrate
Meas. Tech.
Counterscreen for inhibitors of LEDGF/p75-dependent integration: TR-FRET-based biochemical high throughput dose response counterscreen assay to identify activators of HIV-1 Integrase multimerization
IC50
33786±n/a nM
Citation
 PubChem, PC Counterscreen for inhibitors of LEDGF/p75-dependent integration: TR-FRET-based biochemical high throughput dose response counterscreen assay to identify activators of HIV-1 Integrase multimerization PubChem Bioassay (2014)[AID] 
Target
Name:
PC4 and SFRS1-interacting protein
Synonyms:
DFS70 LEDGF/p75 PSIP1_HUMAN lens epithelium-derived growth factor p75
Type:
Enzyme Catalytic Domain
Mol. Mass.:
60120.68
Organism:
Homo sapiens (Human)
Description:
gi_6708281
Residue:
530
  
Inhibitor
Name:
BDBM53382
Synonyms:
(2E,4S,5S,6S,12aS)-2-[amino(hydroxy)methylene]-4-(dimethylamino)-5,6,10,11,12a-pentahydroxy-6-methyl-4,4a,5,5a-tetrahydrotetracene-1,3,12-trione;hydrochloride (2E,4S,5S,6S,12aS)-2-[azanyl(oxidanyl)methylidene]-4-(dimethylamino)-6-methyl-5,6,10,11,12a-pentakis(oxidanyl)-4,4a,5,5a-tetrahydrotetracene-1,3,12-trione;hydrochloride MLS001335873 SMR000875333 | cid_24981353
Type:
Small organic molecule
Emp. Form.:
C22H24N2O9
Mol. Mass.:
460.434
SMILES:
CN(C)[C@H]1C2C(O)C3C(C(=O)c4c(O)cccc4[C@@]3(C)O)C(=O)[C@]2(O)C(=O)C(C(N)=O)C1=O
: