Target
PC4 and SFRS1-interacting protein
Ligand
BDBM80747
Substrate
Meas. Tech.
Counterscreen for inhibitors of LEDGF/p75-dependent integration: TR-FRET-based biochemical high throughput dose response counterscreen assay to identify activators of HIV-1 Integrase multimerization
IC50
953±n/a nM
Citation
 PubChem, PC Counterscreen for inhibitors of LEDGF/p75-dependent integration: TR-FRET-based biochemical high throughput dose response counterscreen assay to identify activators of HIV-1 Integrase multimerization PubChem Bioassay (2014)[AID] 
Target
Name:
PC4 and SFRS1-interacting protein
Synonyms:
DFS70 LEDGF/p75 PSIP1_HUMAN lens epithelium-derived growth factor p75
Type:
Enzyme Catalytic Domain
Mol. Mass.:
60120.68
Organism:
Homo sapiens (Human)
Description:
gi_6708281
Residue:
530
  
Inhibitor
Name:
BDBM80747
Synonyms:
4-oxidanyl-6-phenylazanyl-naphthalene-1-sulfonic acid 6-anilino-4-hydroxy-naphthalene-1-sulfonic acid MLS002637586 cid_219926
Type:
Small organic molecule
Emp. Form.:
C16H13NO4S
Mol. Mass.:
315.344
SMILES:
Oc1ccc(c2ccc(Nc3ccccc3)cc12)S(O)(=O)=O
: