Target
PC4 and SFRS1-interacting protein
Ligand
BDBM114291
Substrate
Meas. Tech.
Counterscreen for inhibitors of LEDGF/p75-dependent integration: TR-FRET-based biochemical high throughput dose response counterscreen assay to identify activators of HIV-1 Integrase multimerization
IC50
347.95±n/a nM
Citation
 PubChem, PC Counterscreen for inhibitors of LEDGF/p75-dependent integration: TR-FRET-based biochemical high throughput dose response counterscreen assay to identify activators of HIV-1 Integrase multimerization PubChem Bioassay (2014)[AID] 
Target
Name:
PC4 and SFRS1-interacting protein
Synonyms:
DFS70 LEDGF/p75 PSIP1_HUMAN lens epithelium-derived growth factor p75
Type:
Enzyme Catalytic Domain
Mol. Mass.:
60120.68
Organism:
Homo sapiens (Human)
Description:
gi_6708281
Residue:
530
  
Inhibitor
Name:
BDBM114291
Synonyms:
8-(3,4,5-trihydroxy-6-keto-xanthen-9-yl)-1-naphthoic acid 8-(3,4,5-trihydroxy-6-oxoxanthen-9-yl)naphthalene-1-carboxylic acid MLS002706942 cid_274108
Type:
Small organic molecule
Emp. Form.:
C24H14O7
Mol. Mass.:
414.3638
SMILES:
OC(=O)c1cccc2cccc(-c3c4ccc(O)c(O)c4oc4c(O)c(=O)ccc34)c12
: