Target
PC4 and SFRS1-interacting protein
Ligand
BDBM46141
Substrate
Meas. Tech.
TR-FRET-based biochemical high throughput dose response assay to identify inhibitors of HIV-1 LEDGF/p75 DNA Integration
IC50
690.86±n/a nM
Citation
 PubChem, PC TR-FRET-based biochemical high throughput dose response assay to identify inhibitors of HIV-1 LEDGF/p75 DNA Integration PubChem Bioassay (2014)[AID] 
Target
Name:
PC4 and SFRS1-interacting protein
Synonyms:
DFS70 LEDGF/p75 PSIP1_HUMAN lens epithelium-derived growth factor p75
Type:
Enzyme Catalytic Domain
Mol. Mass.:
60120.68
Organism:
Homo sapiens (Human)
Description:
gi_6708281
Residue:
530
  
Inhibitor
Name:
BDBM46141
Synonyms:
1-(2-furanylmethyl)-1,3-diazinane-2,4,6-trione 1-(furan-2-ylmethyl)-1,3-diazinane-2,4,6-trione cid_2269367
Type:
Small organic molecule
Emp. Form.:
C9H8N2O4
Mol. Mass.:
208.1708
SMILES:
O=C1CC(=O)N(Cc2ccco2)C(=O)N1
: