Target
PC4 and SFRS1-interacting protein
Ligand
BDBM32310
Substrate
Meas. Tech.
TR-FRET-based biochemical high throughput dose response assay to identify inhibitors of HIV-1 LEDGF/p75 DNA Integration
IC50
1354±n/a nM
Citation
 PubChem, PC TR-FRET-based biochemical high throughput dose response assay to identify inhibitors of HIV-1 LEDGF/p75 DNA Integration PubChem Bioassay (2014)[AID] 
Target
Name:
PC4 and SFRS1-interacting protein
Synonyms:
DFS70 LEDGF/p75 PSIP1_HUMAN lens epithelium-derived growth factor p75
Type:
Enzyme Catalytic Domain
Mol. Mass.:
60120.68
Organism:
Homo sapiens (Human)
Description:
gi_6708281
Residue:
530
  
Inhibitor
Name:
BDBM32310
Synonyms:
MLS000390238 cid_6311834
Type:
Small organic molecule
Emp. Form.:
C25H23N3O4S
Mol. Mass.:
461.533
SMILES:
Nc1c(sc2nc3\C(CCc3c(-c3ccco3)c12)=C\c1ccco1)C(=O)NCC1CCCO1
: