Target
cAMP-specific 3',5'-cyclic phosphodiesterase 7B
Ligand
BDBM116311
Substrate
Meas. Tech.
Scintillation Proximity Assay
pH
8±n/a
IC50
106±n/a nM
Comments
extracted
Citation
 Bergmann, JECutshall, NSDemopulos, GAFlorio, VAGaitanaris, GGray, PHohmann, JOnrust, RZeng, H Use of PDE7 inhibitors for the treatment of movement disorders US Patent  US8637528 Publication Date 1/28/2014 
Target
Name:
cAMP-specific 3',5'-cyclic phosphodiesterase 7B
Synonyms:
3',5'-cyclic phosphodiesterase PDE7B_HUMAN Phosphodiesterase 7B (PDE7B) | cAMP-specific 3',5'-cyclic phosphodiesterase 7B
Type:
Enzyme
Mol. Mass.:
51842.76
Organism:
Homo sapiens (Human)
Description:
Q9NP56
Residue:
450
  
Inhibitor
Name:
BDBM116311
Synonyms:
US8637528, OM955
Type:
Small organic molecule
Emp. Form.:
C16H21ClN2O2
Mol. Mass.:
308.803
SMILES:
CCCOc1ccc(Cl)c2NC(=O)NC3(CCCCC3)c12
: