Target
Aldehyde dehydrogenase, mitochondrial
Ligand
BDBM118207
Substrate
Meas. Tech.
ALDH2 Assay
pH
7.4±n/a
IC50
9±n/a nM
Comments
extracted
Citation
 Graupe, MVenkataramani, CZablocki, J ALDH-2 inhibitors in the treatment of addiction US Patent  US8673966 Publication Date 3/18/2014 
Target
Name:
Aldehyde dehydrogenase, mitochondrial
Synonyms:
ALDH class 2 ALDH2 ALDHI Aldehyde dehydrogenase (ALDH2)
Type:
Enzyme
Mol. Mass.:
56382.67
Organism:
Homo sapiens (Human)
Description:
P05091
Residue:
517
  
Inhibitor
Name:
BDBM118207
Synonyms:
US8673966, tert-butyl 3-((3-(4-(methylsulfonamido)phenyl)- 4-oxo-4H-chromen-7-yl)ethynyl)azetidine-1-carboxylate
Type:
Emp. Form.:
C26H26N2O6S
Mol. Mass.:
494.559
SMILES:
CC(C)(C)OC(=O)N1CC(C1)C#Cc1ccc2c(c1)occ(-c1ccc(NS(C)(=O)=O)cc1)c2=O
: