Target
Aldehyde dehydrogenase, mitochondrial
Ligand
BDBM118224
Substrate
Meas. Tech.
ALDH2 Assay
pH
7.4±n/a
IC50
16±n/a nM
Comments
extracted
Citation
 Graupe, MVenkataramani, CZablocki, J ALDH-2 inhibitors in the treatment of addiction US Patent  US8673966 Publication Date 3/18/2014 
Target
Name:
Aldehyde dehydrogenase, mitochondrial
Synonyms:
ALDH class 2 ALDH2 ALDHI Aldehyde dehydrogenase (ALDH2)
Type:
Enzyme
Mol. Mass.:
56382.67
Organism:
Homo sapiens (Human)
Description:
P05091
Residue:
517
  
Inhibitor
Name:
BDBM118224
Synonyms:
US8673966, N-(4-(7-((1-(2-hydroxy-2-methylpropanoyl)- azetidin-3-yl)ethynyl)-4-oxo-4H-chromen-3-yl)phenyl)methanesulfonamide
Type:
Emp. Form.:
C25H24N2O6S
Mol. Mass.:
480.533
SMILES:
CC(C)(O)C(=O)N1CC(C1)C#Cc1ccc2c(c1)occ(-c1ccc(NS(C)(=O)=O)cc1)c2=O
: