Target
Stromelysin-1
Ligand
BDBM120217
Substrate
Meas. Tech.
Inhibition Assay
Ki
238±n/a nM
Citation
 Devel, LBeau, FCzarny, BDive, V Pseudodipeptides as MMP inhibitors US Patent  US8691753 Publication Date 4/8/2014 
Target
Name:
Stromelysin-1
Synonyms:
MMP-3 MMP3_HUMAN Matrix metalloproteinase 3 Matrix metalloproteinase-3 (MMP-3) SL-1 Stromelysin 1 | Transin-1
Type:
Enzyme
Mol. Mass.:
53973.13
Organism:
Homo sapiens (Human)
Description:
P08254
Residue:
477
  
Inhibitor
Name:
BDBM120217
Synonyms:
US8691753, 66
Type:
Small organic molecule
Emp. Form.:
C29H31N3O5
Mol. Mass.:
501.5735
SMILES:
C[C@H](NC(=O)[C@H](CCC(O)=O)NC(=O)CCc1ccc(cc1)-c1ccc(cc1)-c1ccccc1)C(N)=O
: