Target
Neutrophil collagenase
Ligand
BDBM120192
Substrate
Meas. Tech.
Inhibition Assay
Ki
226±n/a nM
Citation
 Devel, LBeau, FCzarny, BDive, V Pseudodipeptides as MMP inhibitors US Patent  US8691753 Publication Date 4/8/2014 
Target
Name:
Neutrophil collagenase
Synonyms:
CLG1 MMP8 Matrix metalloproteinase-8 PMNL collagenase | PMNL-CL
Type:
Enzyme
Mol. Mass.:
53413.48
Organism:
Homo sapiens (Human)
Description:
P22894
Residue:
467
  
Inhibitor
Name:
BDBM120192
Synonyms:
US8691753, 40
Type:
Small organic molecule
Emp. Form.:
C24H29N3O5
Mol. Mass.:
439.5042
SMILES:
CC[C@H](NC(=O)CCc1ccc(cc1)-c1ccccc1)C(=O)N[C@@H](CCC(O)=O)C(N)=O
: