Target
Stromelysin-2
Ligand
BDBM120217
Substrate
Meas. Tech.
Inhibition Assay
Ki
130±n/a nM
Citation
 Devel, LBeau, FCzarny, BDive, V Pseudodipeptides as MMP inhibitors US Patent  US8691753 Publication Date 4/8/2014 
Target
Name:
Stromelysin-2
Synonyms:
MMP10 Matrix Metalloproteinase-10 (MMP-10) STMY2
Type:
Enzyme
Mol. Mass.:
54143.02
Organism:
Homo sapiens (Human)
Description:
P09238
Residue:
476
  
Inhibitor
Name:
BDBM120217
Synonyms:
US8691753, 66
Type:
Small organic molecule
Emp. Form.:
C29H31N3O5
Mol. Mass.:
501.5735
SMILES:
C[C@H](NC(=O)[C@H](CCC(O)=O)NC(=O)CCc1ccc(cc1)-c1ccc(cc1)-c1ccccc1)C(N)=O
: