Target
Macrophage metalloelastase
Ligand
BDBM120198
Substrate
Meas. Tech.
Inhibition Assay
Ki
58±n/a nM
Citation
 Devel, LBeau, FCzarny, BDive, V Pseudodipeptides as MMP inhibitors US Patent  US8691753 Publication Date 4/8/2014 
Target
Name:
Macrophage metalloelastase
Synonyms:
HME MMP12_HUMAN Matrix metalloproteinase-12 (MMP 12) Matrix metalloproteinase-12 (MMP12) | Matrix metalloproteinases 12 (MMP-12)
Type:
Enzyme
Mol. Mass.:
54012.99
Organism:
Homo sapiens (Human)
Description:
P39900
Residue:
470
  
Inhibitor
Name:
BDBM120198
Synonyms:
US8691753, 47
Type:
Small organic molecule
Emp. Form.:
C23H27N3O5
Mol. Mass.:
425.4776
SMILES:
C[C@H](NC(=O)[C@H](CCC(O)=O)NC(=O)CCc1ccc(cc1)-c1ccccc1)C(N)=O
: