Target
Cell division cycle 7-related protein kinase
Ligand
BDBM123137
Substrate
Meas. Tech.
MSA assay
pH
7.5±n/a
IC50
3±n/a nM
Comments
extracted
Citation
 Irie, TSawa, ASawa, MAsami, TFunakoshi, YTanaka, C Furanone derivative US Patent  US8742113 Publication Date 6/3/2014 
Target
Name:
Cell division cycle 7-related protein kinase
Synonyms:
CDC7 CDC7L1 Cell division cycle 7-related protein kinase (CDC7) huCdc7
Type:
Protein
Mol. Mass.:
63908.16
Organism:
Homo sapiens (Human)
Description:
O00311
Residue:
574
  
Inhibitor
Name:
BDBM123137
Synonyms:
US8742113, 89
Type:
Small organic molecule
Emp. Form.:
C22H18FN3O5
Mol. Mass.:
423.3938
SMILES:
OCCCOC(=O)C1C(=O)C(OC1=Nc1ccc(F)cc1)=Cc1c[nH]c2ncccc12
: