Target
Cell division cycle 7-related protein kinase
Ligand
BDBM123148
Substrate
Meas. Tech.
MSA assay
pH
7.5±n/a
IC50
1±n/a nM
Comments
extracted
Citation
 Irie, TSawa, ASawa, MAsami, TFunakoshi, YTanaka, C Furanone derivative US Patent  US8742113 Publication Date 6/3/2014 
Target
Name:
Cell division cycle 7-related protein kinase
Synonyms:
CDC7 CDC7L1 Cell division cycle 7-related protein kinase (CDC7) huCdc7
Type:
Protein
Mol. Mass.:
63908.16
Organism:
Homo sapiens (Human)
Description:
O00311
Residue:
574
  
Inhibitor
Name:
BDBM123148
Synonyms:
US8742113, 242
Type:
Small organic molecule
Emp. Form.:
C18H15N3O2S
Mol. Mass.:
337.396
SMILES:
Cc1ccsc1CN=C1CC(=O)C(O1)=Cc1c[nH]c2ncccc12
: