Target
Cell division cycle 7-related protein kinase
Ligand
BDBM123151
Substrate
Meas. Tech.
MSA assay
pH
7.5±n/a
IC50
8±n/a nM
Comments
extracted
Citation
 Irie, TSawa, ASawa, MAsami, TFunakoshi, YTanaka, C Furanone derivative US Patent  US8742113 Publication Date 6/3/2014 
Target
Name:
Cell division cycle 7-related protein kinase
Synonyms:
CDC7 CDC7L1 Cell division cycle 7-related protein kinase (CDC7) huCdc7
Type:
Protein
Mol. Mass.:
63908.16
Organism:
Homo sapiens (Human)
Description:
O00311
Residue:
574
  
Inhibitor
Name:
BDBM123151
Synonyms:
US8742113, 246
Type:
Small organic molecule
Emp. Form.:
C21H22F3N5O4
Mol. Mass.:
465.4257
SMILES:
CCOC(=O)C1C(OC(=Cc2c[nH]c3ncccc23)C1=O)=NN1CCN(CC(F)(F)F)CC1
: