Target
RNA-editing ligase 1, mitochondrial
Ligand
BDBM40697
Substrate
Meas. Tech.
Fluorescence-based biochemical high throughput dose response assay to identify inhibitors of Trypanosoma brucei RNA editing ligase 1 (TbREL1).
IC50
>96559±n/a nM
Citation
 PubChem, PC Fluorescence-based biochemical high throughput dose response assay to identify inhibitors of Trypanosoma brucei RNA editing ligase 1 (TbREL1). PubChem Bioassay (2014)[AID] 
Target
Name:
RNA-editing ligase 1, mitochondrial
Synonyms:
REL1 Trypanosoma brucei RNA editing ligase 1
Type:
Enzyme Catalytic Domain
Mol. Mass.:
52299.36
Organism:
Trypanosoma brucei brucei
Description:
gi_342179211
Residue:
469
  
Inhibitor
Name:
BDBM40697
Synonyms:
4-(2,3-dihydroimidazo[2,1-b][1,3]thiazol-6-yl)-1,2-benzenediol 4-(2,3-dihydroimidazo[2,1-b]thiazol-6-yl)benzene-1,2-diol MLS000530540 cid_877570
Type:
Small organic molecule
Emp. Form.:
C11H10N2O2S
Mol. Mass.:
234.274
SMILES:
Oc1ccc(cc1O)-c1cn2CCSc2n1
: