Target
RNA-editing ligase 1, mitochondrial
Ligand
BDBM53882
Substrate
Meas. Tech.
Fluorescence-based biochemical high throughput dose response assay to identify inhibitors of Trypanosoma brucei RNA editing ligase 1 (TbREL1).
IC50
46070±n/a nM
Citation
 PubChem, PC Fluorescence-based biochemical high throughput dose response assay to identify inhibitors of Trypanosoma brucei RNA editing ligase 1 (TbREL1). PubChem Bioassay (2014)[AID] 
Target
Name:
RNA-editing ligase 1, mitochondrial
Synonyms:
REL1 Trypanosoma brucei RNA editing ligase 1
Type:
Enzyme Catalytic Domain
Mol. Mass.:
52299.36
Organism:
Trypanosoma brucei brucei
Description:
gi_342179211
Residue:
469
  
Inhibitor
Name:
BDBM53882
Synonyms:
2-(4-aminophenyl)-3H-benzimidazol-5-amine SMR000290129 cid_24260
Type:
Small organic molecule
Emp. Form.:
C13H12N4
Mol. Mass.:
224.2612
SMILES:
Nc1ccc(cc1)-c1nc2ccc(N)cc2[nH]1
: