Target
RNA-editing ligase 1, mitochondrial
Ligand
BDBM78819
Substrate
Meas. Tech.
Fluorescence-based biochemical high throughput dose response assay to identify inhibitors of Trypanosoma brucei RNA editing ligase 1 (TbREL1).
IC50
>96559±n/a nM
Citation
 PubChem, PC Fluorescence-based biochemical high throughput dose response assay to identify inhibitors of Trypanosoma brucei RNA editing ligase 1 (TbREL1). PubChem Bioassay (2014)[AID] 
Target
Name:
RNA-editing ligase 1, mitochondrial
Synonyms:
REL1 Trypanosoma brucei RNA editing ligase 1
Type:
Enzyme Catalytic Domain
Mol. Mass.:
52299.36
Organism:
Trypanosoma brucei brucei
Description:
gi_342179211
Residue:
469
  
Inhibitor
Name:
BDBM78819
Synonyms:
3-cyclohexyl-N-[2-[(3R,6S)-6-[(4-methoxyphenyl)methyl]-3-(phenylmethyl)-2,3,5,6-tetrahydroimidazo[1,2-a]imidazol-7-yl]ethyl]propanamide N-[2-[(3R,6S)-3-benzyl-6-[(4-methoxyphenyl)methyl]-2,3,5,6-tetrahydroimidazo[1,2-a]imidazol-7-yl]ethyl]-3-cyclohexylpropanamide SMR000386425 | cid_16195701
Type:
Small organic molecule
Emp. Form.:
C31H42N4O2
Mol. Mass.:
502.6908
SMILES:
COc1ccc(C[C@H]2CN3[C@H](Cc4ccccc4)CN=C3N2CCNC(=O)CCC2CCCCC2)cc1
: