Target
RNA-editing ligase 1, mitochondrial
Ligand
BDBM83807
Substrate
Meas. Tech.
Fluorescence-based biochemical high throughput dose response assay to identify inhibitors of Trypanosoma brucei RNA editing ligase 1 (TbREL1).
IC50
>96559±n/a nM
Citation
 PubChem, PC Fluorescence-based biochemical high throughput dose response assay to identify inhibitors of Trypanosoma brucei RNA editing ligase 1 (TbREL1). PubChem Bioassay (2014)[AID] 
Target
Name:
RNA-editing ligase 1, mitochondrial
Synonyms:
REL1 Trypanosoma brucei RNA editing ligase 1
Type:
Enzyme Catalytic Domain
Mol. Mass.:
52299.36
Organism:
Trypanosoma brucei brucei
Description:
gi_342179211
Residue:
469
  
Inhibitor
Name:
BDBM83807
Synonyms:
2-(4-isobutylphenyl)-N'-phenethyl-propionamidine;hydrochloride MLS001163837 cid_24747590
Type:
Small organic molecule
Emp. Form.:
C21H28N2
Mol. Mass.:
308.4604
SMILES:
CC(C)Cc1ccc(cc1)C(C)C(N)=NCCc1ccccc1
: