Target
RNA-editing ligase 1, mitochondrial
Ligand
BDBM22860
Substrate
Meas. Tech.
Fluorescence-based biochemical high throughput dose response assay to identify inhibitors of Trypanosoma brucei RNA editing ligase 1 (TbREL1).
IC50
3510±n/a nM
Citation
 PubChem, PC Fluorescence-based biochemical high throughput dose response assay to identify inhibitors of Trypanosoma brucei RNA editing ligase 1 (TbREL1). PubChem Bioassay (2014)[AID] 
Target
Name:
RNA-editing ligase 1, mitochondrial
Synonyms:
REL1 Trypanosoma brucei RNA editing ligase 1
Type:
Enzyme Catalytic Domain
Mol. Mass.:
52299.36
Organism:
Trypanosoma brucei brucei
Description:
gi_342179211
Residue:
469
  
Inhibitor
Name:
BDBM22860
Synonyms:
1,2-Dione-Based Compound, 17 cid_72810
Type:
Small organic molecule
Emp. Form.:
C12H6N2O2
Mol. Mass.:
210.1882
SMILES:
O=C1C(=O)c2cccnc2-c2ncccc12
: