Target
RNA-editing ligase 1, mitochondrial
Ligand
BDBM128154
Substrate
Meas. Tech.
Fluorescence-based biochemical high throughput dose response assay to identify inhibitors of Trypanosoma brucei RNA editing ligase 1 (TbREL1).
IC50
>96559±n/a nM
Citation
 PubChem, PC Fluorescence-based biochemical high throughput dose response assay to identify inhibitors of Trypanosoma brucei RNA editing ligase 1 (TbREL1). PubChem Bioassay (2014)[AID] 
Target
Name:
RNA-editing ligase 1, mitochondrial
Synonyms:
REL1 Trypanosoma brucei RNA editing ligase 1
Type:
Enzyme Catalytic Domain
Mol. Mass.:
52299.36
Organism:
Trypanosoma brucei brucei
Description:
gi_342179211
Residue:
469
  
Inhibitor
Name:
BDBM128154
Synonyms:
2-(allylamino)-6-methyl-1-[4-(trifluoromethyl)benzyl]-4-[2-(trifluoromethyl)phenyl]-4H-pyrimidine-5-carboxylic acid methyl ester MLS003843142 cid_53316244 | methyl 6-methyl-2-(prop-2-enylamino)-4-[2-(trifluoromethyl)phenyl]-1-[[4-(trifluoromethyl)phenyl]methyl]-4H-pyrimidine-5-carboxylate
Type:
Small organic molecule
Emp. Form.:
C25H23F6N3O2
Mol. Mass.:
511.4594
SMILES:
COC(=O)C1=C(C)N(Cc2ccc(cc2)C(F)(F)F)C(NCC=C)=NC1c1ccccc1C(F)(F)F
: