Target
RNA-editing ligase 1, mitochondrial
Ligand
BDBM128165
Substrate
Meas. Tech.
Fluorescence-based biochemical high throughput dose response assay to identify inhibitors of Trypanosoma brucei RNA editing ligase 1 (TbREL1).
IC50
>96559±n/a nM
Citation
 PubChem, PC Fluorescence-based biochemical high throughput dose response assay to identify inhibitors of Trypanosoma brucei RNA editing ligase 1 (TbREL1). PubChem Bioassay (2014)[AID] 
Target
Name:
RNA-editing ligase 1, mitochondrial
Synonyms:
REL1 Trypanosoma brucei RNA editing ligase 1
Type:
Enzyme Catalytic Domain
Mol. Mass.:
52299.36
Organism:
Trypanosoma brucei brucei
Description:
gi_342179211
Residue:
469
  
Inhibitor
Name:
BDBM128165
Synonyms:
6-methyl-1-[3-(trifluoromethyl)benzyl]-2-[[4-(trifluoromethyl)benzyl]amino]-4-[2-(trifluoromethyl)phenyl]-4H-pyrimidine-5-carboxylic acid methyl ester MLS003843154 cid_53316257 | methyl 6-methyl-4-[2-(trifluoromethyl)phenyl]-1-[[3-(trifluoromethyl)phenyl]methyl]-2-[[4-(trifluoromethyl)phenyl]methylamino]-4H-pyrimidine-5-carboxylate
Type:
Small organic molecule
Emp. Form.:
C30H24F9N3O2
Mol. Mass.:
629.5161
SMILES:
COC(=O)C1=C(C)N(Cc2cccc(c2)C(F)(F)F)C(NCc2ccc(cc2)C(F)(F)F)=NC1c1ccccc1C(F)(F)F
: