Target
RNA-editing ligase 1, mitochondrial
Ligand
BDBM128178
Substrate
Meas. Tech.
Fluorescence-based biochemical high throughput dose response assay to identify inhibitors of Trypanosoma brucei RNA editing ligase 1 (TbREL1).
IC50
>96559±n/a nM
Citation
 PubChem, PC Fluorescence-based biochemical high throughput dose response assay to identify inhibitors of Trypanosoma brucei RNA editing ligase 1 (TbREL1). PubChem Bioassay (2014)[AID] 
Target
Name:
RNA-editing ligase 1, mitochondrial
Synonyms:
REL1 Trypanosoma brucei RNA editing ligase 1
Type:
Enzyme Catalytic Domain
Mol. Mass.:
52299.36
Organism:
Trypanosoma brucei brucei
Description:
gi_342179211
Residue:
469
  
Inhibitor
Name:
BDBM128178
Synonyms:
6-methyl-4-(2-phenylethyl)-1-[[3-(trifluoromethyl)phenyl]methyl]-2-[(3,4,5-trimethoxyphenyl)methylamino]-4H-pyrimidine-5-carboxylic acid methyl ester MLS003843210 cid_53316304 | methyl 6-methyl-4-(2-phenylethyl)-1-[[3-(trifluoromethyl)phenyl]methyl]-2-[(3,4,5-trimethoxyphenyl)methylamino]-4H-pyrimidine-5-carboxylate
Type:
Small organic molecule
Emp. Form.:
C33H36F3N3O5
Mol. Mass.:
611.6512
SMILES:
COC(=O)C1=C(C)N(Cc2cccc(c2)C(F)(F)F)C(NCc2cc(OC)c(OC)c(OC)c2)=NC1CCc1ccccc1
: