Target
RNA-editing ligase 1, mitochondrial
Ligand
BDBM128181
Substrate
Meas. Tech.
Fluorescence-based biochemical high throughput dose response assay to identify inhibitors of Trypanosoma brucei RNA editing ligase 1 (TbREL1).
IC50
>96559±n/a nM
Citation
 PubChem, PC Fluorescence-based biochemical high throughput dose response assay to identify inhibitors of Trypanosoma brucei RNA editing ligase 1 (TbREL1). PubChem Bioassay (2014)[AID] 
Target
Name:
RNA-editing ligase 1, mitochondrial
Synonyms:
REL1 Trypanosoma brucei RNA editing ligase 1
Type:
Enzyme Catalytic Domain
Mol. Mass.:
52299.36
Organism:
Trypanosoma brucei brucei
Description:
gi_342179211
Residue:
469
  
Inhibitor
Name:
BDBM128181
Synonyms:
2-[(4-methoxyphenyl)methylamino]-6-methyl-4-phenyl-1-[[2-(trifluoromethyl)phenyl]methyl]-4H-pyrimidine-5-carboxylic acid methyl ester MLS003843352 cid_53316160 | methyl 2-[(4-methoxyphenyl)methylamino]-6-methyl-4-phenyl-1-[[2-(trifluoromethyl)phenyl]methyl]-4H-pyrimidine-5-carboxylate
Type:
Small organic molecule
Emp. Form.:
C29H28F3N3O3
Mol. Mass.:
523.5461
SMILES:
COC(=O)C1=C(C)N(Cc2ccccc2C(F)(F)F)C(NCc2ccc(OC)cc2)=NC1c1ccccc1
: