Target
Transthyretin
Ligand
BDBM128208
Substrate
Meas. Tech.
Counterscreen for activators of Transthyretin (TTR) transcription: Luminescence-based cell-based high throughput dose response assay to identify inhibitors of Transthyretin (TTR) transcription in HuH7
IC50
>167158±n/a nM
Citation
 PubChem, PC Counterscreen for activators of Transthyretin (TTR) transcription: Luminescence-based cell-based high throughput dose response assay to identify inhibitors of Transthyretin (TTR) transcription in HuH7 hepatoma cells PubChem Bioassay (2014)[AID] 
Target
Name:
Transthyretin
Synonyms:
ATTR Prealbumin TTHY_HUMAN Transthyretin (TTR)
Type:
Enzyme
Mol. Mass.:
15884.31
Organism:
Homo sapiens (Human)
Description:
P02766
Residue:
147
  
Inhibitor
Name:
BDBM128208
Synonyms:
1-(2,3-Dimethyl-indol-1-yl)-2-(3,5-dimethyl-pyrazol-1-yl)-ethanone 1-(2,3-dimethylindol-1-yl)-2-(3,5-dimethylpyrazol-1-yl)ethanone SMR000117800 | cid_802846
Type:
Small organic molecule
Emp. Form.:
C17H19N3O
Mol. Mass.:
281.3523
SMILES:
Cc1cc(C)n(CC(=O)n2c(C)c(C)c3ccccc23)n1
: