Target
Transthyretin
Ligand
BDBM128220
Substrate
Meas. Tech.
Counterscreen for activators of Transthyretin (TTR) transcription: Luminescence-based cell-based high throughput dose response assay to identify inhibitors of Transthyretin (TTR) transcription in HuH7
IC50
>167158±n/a nM
Citation
 PubChem, PC Counterscreen for activators of Transthyretin (TTR) transcription: Luminescence-based cell-based high throughput dose response assay to identify inhibitors of Transthyretin (TTR) transcription in HuH7 hepatoma cells PubChem Bioassay (2014)[AID] 
Target
Name:
Transthyretin
Synonyms:
ATTR Prealbumin TTHY_HUMAN Transthyretin (TTR)
Type:
Enzyme
Mol. Mass.:
15884.31
Organism:
Homo sapiens (Human)
Description:
P02766
Residue:
147
  
Inhibitor
Name:
BDBM128220
Synonyms:
4-(cyclopentylamino)-N-(1,5-dimethyl-3-oxidanylidene-2-phenyl-pyrazol-4-yl)-3-nitro-benzenesulfonamide 4-(cyclopentylamino)-N-(1,5-dimethyl-3-oxo-2-phenylpyrazol-4-yl)-3-nitrobenzenesulfonamide MLS000393676 cid_4681574
Type:
Small organic molecule
Emp. Form.:
C22H25N5O5S
Mol. Mass.:
471.529
SMILES:
Cc1c(NS(=O)(=O)c2ccc(NC3CCCC3)c(c2)[N+]([O-])=O)c(=O)n(-c2ccccc2)n1C
: