Target
Transthyretin
Ligand
BDBM128232
Substrate
Meas. Tech.
Counterscreen for activators of Transthyretin (TTR) transcription: Luminescence-based cell-based high throughput dose response assay to identify inhibitors of Transthyretin (TTR) transcription in HuH7
IC50
>167158±n/a nM
Citation
 PubChem, PC Counterscreen for activators of Transthyretin (TTR) transcription: Luminescence-based cell-based high throughput dose response assay to identify inhibitors of Transthyretin (TTR) transcription in HuH7 hepatoma cells PubChem Bioassay (2014)[AID] 
Target
Name:
Transthyretin
Synonyms:
ATTR Prealbumin TTHY_HUMAN Transthyretin (TTR)
Type:
Enzyme
Mol. Mass.:
15884.31
Organism:
Homo sapiens (Human)
Description:
P02766
Residue:
147
  
Inhibitor
Name:
BDBM128232
Synonyms:
3-(3,4-Dimethoxy-phenyl)-5-thiophen-2-yl-[1,2,4]oxadiazole 3-(3,4-dimethoxyphenyl)-5-thiophen-2-yl-1,2,4-oxadiazole SMR000437691 | cid_1221653
Type:
Small organic molecule
Emp. Form.:
C14H12N2O3S
Mol. Mass.:
288.322
SMILES:
COc1ccc(cc1OC)-c1noc(n1)-c1cccs1
: