Target
Transthyretin
Ligand
BDBM128233
Substrate
Meas. Tech.
Counterscreen for activators of Transthyretin (TTR) transcription: Luminescence-based cell-based high throughput dose response assay to identify inhibitors of Transthyretin (TTR) transcription in HuH7
IC50
90915±n/a nM
Citation
 PubChem, PC Counterscreen for activators of Transthyretin (TTR) transcription: Luminescence-based cell-based high throughput dose response assay to identify inhibitors of Transthyretin (TTR) transcription in HuH7 hepatoma cells PubChem Bioassay (2014)[AID] 
Target
Name:
Transthyretin
Synonyms:
ATTR Prealbumin TTHY_HUMAN Transthyretin (TTR)
Type:
Enzyme
Mol. Mass.:
15884.31
Organism:
Homo sapiens (Human)
Description:
P02766
Residue:
147
  
Inhibitor
Name:
BDBM128233
Synonyms:
(5Z)-5-[(E)-3-(1,3-benzodioxol-5-yl)-1-hydroxy-prop-2-enylidene]-1-butyl-barbituric acid (5Z)-5-[(E)-3-(1,3-benzodioxol-5-yl)-1-oxidanyl-prop-2-enylidene]-1-butyl-1,3-diazinane-2,4,6-trione MLS000763033 cid_54677751
Type:
Small organic molecule
Emp. Form.:
C18H18N2O6
Mol. Mass.:
358.3453
SMILES:
CCCCN1C(=O)NC(=O)\C(=C(\O)/C=C/c2ccc3OCOc3c2)C1=O
: