Target
Transthyretin
Ligand
BDBM128245
Substrate
Meas. Tech.
Counterscreen for activators of Transthyretin (TTR) transcription: Luminescence-based cell-based high throughput dose response assay to identify inhibitors of Transthyretin (TTR) transcription in HuH7
IC50
114985±n/a nM
Citation
 PubChem, PC Counterscreen for activators of Transthyretin (TTR) transcription: Luminescence-based cell-based high throughput dose response assay to identify inhibitors of Transthyretin (TTR) transcription in HuH7 hepatoma cells PubChem Bioassay (2014)[AID] 
Target
Name:
Transthyretin
Synonyms:
ATTR Prealbumin TTHY_HUMAN Transthyretin (TTR)
Type:
Enzyme
Mol. Mass.:
15884.31
Organism:
Homo sapiens (Human)
Description:
P02766
Residue:
147
  
Inhibitor
Name:
BDBM128245
Synonyms:
MLS003875108 N-methyl-N-(phenylmethyl)carbamic acid [1-[(2-methylphenyl)methyl]-4-triazolyl]methyl ester [1-[(2-methylphenyl)methyl]-1,2,3-triazol-4-yl]methyl N-methyl-N-(phenylmethyl)carbamate cid_60157353
Type:
Small organic molecule
Emp. Form.:
C20H22N4O2
Mol. Mass.:
350.4143
SMILES:
CN(Cc1ccccc1)C(=O)OCc1cn(Cc2ccccc2C)nn1
: