Target
Transthyretin
Ligand
BDBM128202
Substrate
Meas. Tech.
Luminescence-based cell-based high throughput dose response assay to identify activators of Transthyretin (TTR) transcription
EC50
>167158±n/a nM
Citation
 PubChem, PC Luminescence-based cell-based high throughput dose response assay to identify activators of Transthyretin (TTR) transcription PubChem Bioassay (2014)[AID] 
Target
Name:
Transthyretin
Synonyms:
ATTR Prealbumin TTHY_HUMAN Transthyretin (TTR)
Type:
Enzyme
Mol. Mass.:
15884.31
Organism:
Homo sapiens (Human)
Description:
P02766
Residue:
147
  
Inhibitor
Name:
BDBM128202
Synonyms:
4-(2-pyridinylthio)benzofuro[3,2-d]pyrimidine 4-(Pyridin-2-ylsulfanyl)-benzo[4,5]furo[3,2-d]pyrimidine MLS000071568 cid_624350
Type:
Small organic molecule
Emp. Form.:
C15H9N3OS
Mol. Mass.:
279.316
SMILES:
S(c1ccccn1)c1ncnc2c3ccccc3oc12
: