Target
Transthyretin
Ligand
BDBM55866
Substrate
Meas. Tech.
Luminescence-based cell-based high throughput dose response assay to identify activators of Transthyretin (TTR) transcription
EC50
>167158±n/a nM
Citation
 PubChem, PC Luminescence-based cell-based high throughput dose response assay to identify activators of Transthyretin (TTR) transcription PubChem Bioassay (2014)[AID] 
Target
Name:
Transthyretin
Synonyms:
ATTR Prealbumin TTHY_HUMAN Transthyretin (TTR)
Type:
Enzyme
Mol. Mass.:
15884.31
Organism:
Homo sapiens (Human)
Description:
P02766
Residue:
147
  
Inhibitor
Name:
BDBM55866
Synonyms:
1-Cyclopropyl-3-{2-[2-(1,3-dimethyl-2,4,6-trioxo-tetrahydro-pyrimidin-5-ylidenemethyl)-1H-indol-3-yl]-eth yl}-thiourea 1-cyclopropyl-3-[2-[2-[(2,4,6-triketo-1,3-dimethyl-hexahydropyrimidin-5-ylidene)methyl]-1H-indol-3-yl]ethyl]thiourea MLS000332961 cid_5620224
Type:
Small organic molecule
Emp. Form.:
C21H23N5O3S
Mol. Mass.:
425.504
SMILES:
CN1C(=O)N(C)C(=O)C(=Cc2[nH]c3ccccc3c2CCNC(=S)NC2CC2)C1=O
: