Target
Sphingosine 1-phosphate receptor 1
Ligand
BDBM129595
Substrate
Meas. Tech.
Receptor Binding Assay
pH
7.4±n/a
Temperature
277.15±n/a K
Ki
2.065±n/a nM
Comments
extracted
Citation
 Quattropani, ABaker-Glenn, CBlackaby, WKnight, C Pyrazole oxadiazole derivatives as S1P1 agonists US Patent  US8802663 Publication Date 8/12/2014 
Target
Name:
Sphingosine 1-phosphate receptor 1
Synonyms:
CHEDG1 Endothelial differentiation G-protein coupled receptor 1 S1P1 S1PR1_HUMAN Sphingosine 1-phosphate receptor Edg-1
Type:
Enzyme
Mol. Mass.:
42836.02
Organism:
Homo sapiens (Human)
Description:
P21453
Residue:
382
  
Inhibitor
Name:
BDBM129595
Synonyms:
US8802663, 136 | US8802663, 148
Type:
Small organic molecule
Emp. Form.:
C26H25N7O
Mol. Mass.:
451.523
SMILES:
C(c1ccc(cc1)-c1noc(n1)-c1cnn(C2CCCCC2)c1-c1ccncc1)n1ccnc1
: