Target
Proto-oncogene tyrosine-protein kinase ROS
Ligand
BDBM130909
Substrate
Meas. Tech.
In Vitro Kinase Activity Assay
pH
7.5±n/a
IC50
0.248±n/a nM
Comments
extracted
Citation
 Gregor, VE Tyrosine kinase inhibitors US Patent  US8822500 Publication Date 9/2/2014 
Target
Name:
Proto-oncogene tyrosine-protein kinase ROS
Synonyms:
MCF3 Proto-oncogene c-Ros-1 ROS1 Receptor tyrosine kinase c-ros oncogene 1 c-Ros receptor tyrosine kinase
Type:
Enzyme
Mol. Mass.:
263897.39
Organism:
Homo sapiens (Human)
Description:
P08922
Residue:
2347
  
Inhibitor
Name:
BDBM130909
Synonyms:
US10683289, Example Staurosporine US8822500, Stauro- sporine | US9920060, Staurosporine
Type:
Small organic molecule
Emp. Form.:
C28H26N4O3
Mol. Mass.:
466.531
SMILES:
CNC1CC2OC(C)(C1OC)n1c3ccccc3c3c4CNC(=O)c4c4c5ccccc5n2c4c13
: