Target
5-hydroxytryptamine receptor 1B
Ligand
BDBM136331
Substrate
Meas. Tech.
Inhibition Assay
pH
7.4±n/a
Ki
3.3±n/a nM
Comments
extracted
Citation
 Andersson, JGyback, HJohansson, ALinde, CEMalmstrom, JNordvall, GWeigelt, TTerp, G 2-carboxamide-7-piperazinyl-benzofuran derivatives US Patent  US8859534 Publication Date 10/14/2014 
Target
Name:
5-hydroxytryptamine receptor 1B
Synonyms:
5-HT1B 5-hydroxytryptamine receptor 1B (5HT1B) HTR1B
Type:
Protein
Mol. Mass.:
42909.60
Organism:
Cricetulus griseus (Chinese hamster) (Cricetulus barabensis griseus)
Description:
P46636
Residue:
386
  
Inhibitor
Name:
BDBM136331
Synonyms:
US8859534, 17
Type:
Small organic molecule
Emp. Form.:
C29H32N4O4S
Mol. Mass.:
532.654
SMILES:
CS(=O)(=O)Cc1ccc(CNC(=O)c2cc3cccc(N4CCN(CCc5ccccn5)CC4)c3o2)cc1
: