Target
3-phosphoinositide-dependent protein kinase 1
Ligand
BDBM139819
Substrate
Meas. Tech.
Kinase Assay
pH
7.5±n/a
IC50
1±n/a nM
Comments
extracted
Citation
 McConnell, DEngelhardt, HKofink, C 1H-imidazo[4,5-c]quinolines US Patent  US8895581 Publication Date 11/25/2014 
Target
Name:
3-phosphoinositide-dependent protein kinase 1
Synonyms:
3-Phosphoinositide-Dependent Protein Kinase 1 (PDK1) 3-phosphoinositide-dependent protein kinase 1 3-phosphoinositide-dependent protein kinase 1 (PDK-1) Isoform 2 of 3-phosphoinositide-dependent protein kinase 1 PDPK1 Phosphoinositide-dependent protein kinase 1 (PDK1) hPDK1
Type:
Enzyme
Mol. Mass.:
63157.65
Organism:
Homo sapiens (Human)
Description:
O15530
Residue:
556
  
Inhibitor
Name:
BDBM139819
Synonyms:
US8895581, III-5
Type:
Small organic molecule
Emp. Form.:
C36H36F2N6O2
Mol. Mass.:
622.7068
SMILES:
C[C@@H](c1ccc(F)c(F)c1)n1cccc(C(=O)NCC#Cc2ccc3ncc4nc(C)n([C@@H]5CC[C@@H](CC5)N(C)C)c4c3c2)c1=O
: