Target
CMP-N-acetylneuraminate-beta-galactosamide-alpha-2,3-sialyltransferase 2
Ligand
BDBM142762
Substrate
Meas. Tech.
Enzyme Inhibition Assay
IC50
139000±n/a nM
Citation
 Li, WWang, YJuan, H Lithocholic acid analogues that inhibit sialyltransferase US Patent  US8940719 Publication Date 1/27/2015 
Target
Name:
CMP-N-acetylneuraminate-beta-galactosamide-alpha-2,3-sialyltransferase 2
Synonyms:
SIA4B_RAT Siat5 alpha-2,3-sialyltransferase
Type:
Enzyme
Mol. Mass.:
40178.44
Organism:
Rattus norvegicus (Rat)
Description:
Q11205
Residue:
350
  
Inhibitor
Name:
BDBM142762
Synonyms:
US8940719, 11
Type:
Small organic molecule
Emp. Form.:
C24H38O3
Mol. Mass.:
374.5567
SMILES:
C[C@H](CCC(O)=O)C1CC[C@H]2C3CC[C@@H]4CC(=O)CC[C@]4(C)C3CC[C@]12C
: