Target
Beta-secretase 2
Ligand
BDBM143224
Substrate
Meas. Tech.
HTRF assay
pH
5±n/a
Temperature
303.15±n/a K
Ki
0.47±n/a nM
Comments
extracted
Citation
 Scott, JDStamford, AWGilbert, EJCumming, JNIserloh, U Iminothiadiazine dioxide compounds as BACE inhibitors, compositions, and their use US Patent  US8940748 Publication Date 1/27/2015 
Target
Name:
Beta-secretase 2
Synonyms:
AEPLC ASP1 Asp 1 Aspartyl protease 1 BACE2_HUMAN Beta-secretase (BACE) Beta-secretase 2 (BACE-2) Beta-site APP-cleaving enzyme 2 Memapsin-1 beta-Secretase (BACE-2)
Type:
Protein
Mol. Mass.:
56171.20
Organism:
Homo sapiens (Human)
Description:
Q9Y5Z0
Residue:
518
  
Inhibitor
Name:
BDBM143224
Synonyms:
US8940748, 173 | US9687494, 173
Type:
Small organic molecule
Emp. Form.:
C17H16F3N5O3S
Mol. Mass.:
427.401
SMILES:
CN1C(=N)N[C@@](C)(CS1(=O)=O)c1c(F)ccc(NC(=O)c2ccc(F)cn2)c1F
: