Target
Solute carrier organic anion transporter family member 2A1
Ligand
BDBM144819
Substrate
Meas. Tech.
Inhibition Assay
Temperature
298.15±n/a K
IC50
31.7±n/a nM
Comments
extracted
Citation
 Schuster, VLChi, YWasmuth, ASPottorf, RSOlson, GL Prostaglandin transporter inhibitors and uses thereof US Patent  US8952150 Publication Date 2/10/2015 
Target
Name:
Solute carrier organic anion transporter family member 2A1
Synonyms:
Matr1 Prostaglandin transporter (PGT) Slc21a2 Solute carrier family 21 member 2
Type:
Protein
Mol. Mass.:
70404.97
Organism:
Rattus norvegicus (Rat)
Description:
Q00910
Residue:
644
  
Inhibitor
Name:
BDBM144819
Synonyms:
US8952150, 147
Type:
Small organic molecule
Emp. Form.:
C34H33FN8O4
Mol. Mass.:
636.6754
SMILES:
Oc1ccc(Nc2nc(NCCOCCNC(=O)c3ccccc3)nc(Nc3ccc(cc3)C(=O)NCc3ccc(F)cc3)n2)cc1
: