Target
Translocator protein
Ligand
BDBM150164
Substrate
Meas. Tech.
Competitive Binding Assay
Temperature
303.15±n/a K
Ki
7.17±n/a nM
IC50
16.86±n/a nM
Comments
extracted
Citation
 Yang, RLi, YLi, YZhao, NYun, LQin, JFeng, ZZhang, Y 2-aryl imidazo[1,2-a]pyridine-3-acetamide derivatives, preparation methods and uses thereof US Patent  US8980887 Publication Date 3/17/2015 
Target
Name:
Translocator protein
Synonyms:
Benzodiazepine receptors; peripheral & central Mbr PBR Peripheral benzodiazepine receptor (PBR) TSPO_RAT | Tspo
Type:
Mitochondrion membrane protein
Mol. Mass.:
18945.84
Organism:
Rattus norvegicus (rat)
Description:
Competitive binding experiments were performed on rat kidney mitochondrial membranes.
Residue:
169
  
Inhibitor
Name:
BDBM150164
Synonyms:
US8980887, Compound 1
Type:
Small organic molecule
Emp. Form.:
C25H24ClN3O
Mol. Mass.:
417.931
SMILES:
CCN(Cc1ccccc1)C(=O)Cc1c(nc2cc(C)ccn12)-c1ccc(Cl)cc1
: