Target
1-deoxy-D-xylulose 5-phosphate reductoisomerase
Ligand
BDBM152418
Substrate
Meas. Tech.
DXP Synthase Inhibition Assay
pH
8±n/a
Ki
1.0e+3± 2e+2 nM
Comments
extracted
Citation
 Bartee, DMorris, FAl-Khouja, AFreel Meyers, CL Hydroxybenzaldoximes Are D-GAP-Competitive Inhibitors of E. coli 1-Deoxy-D-Xylulose-5-Phosphate Synthase. Chembiochem 16:1771-81 (2015)  
Target
Name:
1-deoxy-D-xylulose 5-phosphate reductoisomerase
Synonyms:
1-Deoxy-D-xylulose 5-phosphate reductoisomerase (DXP) 1-deoxy-D-xylulose 5-phosphate reductoisomerase (DXR) DXP reductoisomerase dxr yaeM
Type:
Protein
Mol. Mass.:
43384.52
Organism:
Escherichia coli
Description:
P45568
Residue:
398
  
Inhibitor
Name:
BDBM152418
Synonyms:
(1E,1’E)-O,O’-(Ethane-1,2-diyl)bis[2,4,5-trihydroxybenzaldehyde oxime] (5)
Type:
Small organic molecule
Emp. Form.:
C16H16N2O8
Mol. Mass.:
364.3068
SMILES:
Oc1cc(O)c(\C=N\OCCO\N=C\c2cc(O)c(O)cc2O)cc1O
: