Target
1-deoxy-D-xylulose 5-phosphate reductoisomerase
Ligand
BDBM152432
Substrate
Meas. Tech.
DXP Synthase Inhibition Assay
pH
8±n/a
Ki
>2.00e+5±n/a nM
Comments
extracted
Citation
 Bartee, DMorris, FAl-Khouja, AFreel Meyers, CL Hydroxybenzaldoximes Are D-GAP-Competitive Inhibitors of E. coli 1-Deoxy-D-Xylulose-5-Phosphate Synthase. Chembiochem 16:1771-81 (2015)  
Target
Name:
1-deoxy-D-xylulose 5-phosphate reductoisomerase
Synonyms:
1-Deoxy-D-xylulose 5-phosphate reductoisomerase (DXP) 1-deoxy-D-xylulose 5-phosphate reductoisomerase (DXR) DXP reductoisomerase dxr yaeM
Type:
Protein
Mol. Mass.:
43384.52
Organism:
Escherichia coli
Description:
P45568
Residue:
398
  
Inhibitor
Name:
BDBM152432
Synonyms:
(E)-4-Hydroxy-3-nitrobenzaldehyde O-methyl oxime (20)
Type:
Small organic molecule
Emp. Form.:
C8H8N2O4
Mol. Mass.:
196.1601
SMILES:
CO\N=C\c1ccc(O)c(c1)[N+]([O-])=O
: